{"text_format":"1","workbook":"xlsx","n_sheets":7,"sheets":["Form","master","OperationsInput","PrintInvoice","DataForINSIS","ContractNumberCreator","SummToText"],"not_rendered":{"charts":0,"images":5,"macros":1,"external_links":0,"defined_names":6,"comments":0,"pivot_tables":0},"unopened":[],"bounds":{"document_bytes":16777216,"sheet_cells":100000,"rows_first":2000,"rows_last":500,"rows_between":2000,"halvings":0,"cell_chars":16384,"cell_head_chars":4096},"cells_cut":0,"cells_raw":0,"read":"whole","date_system":"1900"}

{"sheet":"Form","index":0,"n_rows":97,"n_cols":4,"rows_kept":97,"cut":false,"hidden":false,"merged":[[74,3,82,15],[41,3,41,11],[54,3,54,11],[67,3,67,11]]}
["Выбор программы"]
["Программа (для выбора ) / Program ","Комфорт","<Please select>"]
["Стоимость / Price",{"$f":"VLOOKUP(B2,master!A:C,2,TRUE)","v":2440},{"$f":"VLOOKUP(B2,master!A:C,3,TRUE)","v":"RUB"}]
[null,{"$f":"IF(B2=\"Базовая\", \"В программе Базовая предусмотрено страхование только квартир\", \" \")","v":" "}]
["Форма для заполнения сотрудником"]
[]
["Данные застрахованного лица / Insured person information"]
["Фамилия / Surname *",null,"<Please type in>"]
["Имя / First Name *",null,"<Please type in>"]
["Отчество / Patronymic name",null,"<Please type in>"]
["Дата рождения / Birth Date *",null,"<Please type in>",{"$f":"IF(B11=\"\",\"\",IF(AND((YEAR(NOW())-YEAR(B11))>17,((YEAR(NOW())-YEAR(B11))<65)),\"\",\"Возраст клиента должен быть от 18 до 64 лет включительно. / Client's age is out of the allowed age interval from 18 till 64 years.\"))","v":""}]
["Пол / Gender *","Мужской","<Please select>"]
["ИНН / TIN (Identification number of taxpayer)",null,"<Please type in>"]
["Место рождения / Place of birth *",null,"<Please type in>"]
[]
["Документ удостоверяющий личность / Type of identity document"]
["Документ удостоверяющий личность / Type of identity document *","Паспорт гражданина РФ","<Please select>"]
["Гражданство / Citizenship *",null,"<Please type in>"]
["Серия / Document series *",null,"<Please type in>"]
["Номер / Document  number *",null,"<Please type in>"]
["Выдан (кем) / Place document was issued *",null,"<Please type in>"]
["Дата выдачи / Date of issuing Document *",null,"<Please type in>"]
["Код подразделения / Code of issuing place *",null,"<Please type in>"]
[]
["Миграционные документы / Mirgation Documents"]
["Номер миграционной карты / Migration Card number",null,"<Please type in>"]
["Дата начала действия МК / Migration Card from",null,"<Please type in>"]
["Дата окончания МК / Migration Card to",null,"<Please type in>"]
["Type of the document confirming the right to stay in Russia","<please choose>","<Please select>"]
["Право нахождения с / Right to stay from",null,"<Please type in>"]
["Право нахождения по / Right to stay to",null,"<Please type in>"]
[]
["Адрес регистрации / Registration address"]
["Регион / Region *","г Москва","<Please select>"]
["Город или населенный пункт / City *",null,"<Please type in>"]
["Улица / Street",null,"<Please type in>"]
["Дом / House * ",null,"<Please type in>"]
["Корпус / Housing",null,"<Please type in>"]
["Строение / Building",null,"<Please type in>"]
["Квартира / Apartment *",null,"<Please type in>"]
["Индекс / Post code *",null,"<Please type in>"]
["КЛАДР адреса *",null,"<Please type in>","*Чтобы вставить КЛАДР в верном формате, зайдите по ссылке ниже на сайт, введите свой адрес, скопируйте найденный код КЛАДР и нажмите на кнопку:"]
["КЛАДР кода города *",{"$f":"IF(LEN(B42)>12,LEFT(B42,13),\"\")","v":""},"<Automatically>","https://www.alta.ru/fias/"]
[]
["Фактический адрес / Actual address","* При совпадении адреса достаточно отметить это флажком в следующем поле, полное заполнение блока не требуется"]
["Совпадает с адресом регистрации / Matches registration address *","Да / Yes","<Please select>"]
["Регион / Region","г Москва","<Please select>"]
["Город или населенный пункт / City",null,"<Please type in>"]
["Улица / Street",null,"<Please type in>"]
["Дом / House",null,"<Please type in>"]
["Корпус / Housing",null,"<Please type in>"]
["Строение / Building",null,"<Please type in>"]
["Квартира / Apartment",null,"<Please type in>"]
["Индекс / Post code",null,"<Please type in>"]
["КЛАДР адреса",null,"<Please type in>","*Чтобы вставить КЛАДР в верном формате, зайдите по ссылке ниже на сайт, введите свой адрес, скопируйте найденный код КЛАДР и нажмите на кнопку:"]
["КЛАДР кода города",{"$f":"IF(LEN(B55)>12,LEFT(B55,13),\"\")","v":""},"<Automatically>","https://www.alta.ru/fias/"]
[]
["Адрес объекта страхования / Address of insured property","* При совпадении адреса достаточно отметить это флажком в следующем поле, полное заполнение блока не требуется"]
["Совпадает с адресом / Matches with address *","Нет / No","<Please select>"]
["Регион / Region","Московская обл","<Please select>"]
{"$rows_left_out":38}
{"sheet":"master","index":1,"n_rows":94,"n_cols":17,"rows_kept":94,"cut":false,"hidden":true,"merged":[]}
["Программа","цена","валюта","Покрытие","Пол","Регионы","ДокументУдостоверяющийЛичность","Регистрации / Register","ТипДокументаПодтверждающегоПравоИностранногоГражданинаИлиЛицаБезГражданстваНаПроживание_Пребывание",null,"Да-Нет",null,"Is Insured person foreign public authority or close relative?",null,"Наименование программы","Код программы","Признак частного дома"]
["Базовая",1240,"RUB",null,"Мужской","г Москва","Паспорт гражданина РФ","Фактическим / Actual","Разрешение на временное проживание",null,"Да / Yes",null,"Нет",null,"Базовая","ClassicNEW_SG","Да / Yes"]
["Комфорт",2440,"RUB",null,"Женский","Московская обл","Загранпаспорт","Нет / No","Вид на жительство",null,"Нет / No",null,"Российское ПДЛ",null,"Комфорт","Comfort_SG","Нет / No"]
["ПремиумДом",5240,"RUB",null,null,"г Санкт-Петербург","Дипломатический паспорт, служебный паспорт",null,"Виза",null,null,null,"Иностранное ПДЛ",null,"ПремиумДом","PremiumNEW_SG"]
["ПремиумЭко",5240,"RUB",null,null,"Адыгея Респ","Временное удостоверение личности РФ",null,"Отрывная часть бланка",null,null,null,"ПДЛ Международной организации",null,"ПремиумЭко","PremiumECO_SG"]
[null,null,null,null,null,"Алтай Респ","Паспорт иностранного гражданина",null,"Патент",null,null,null,"Супруг/Родственник ПДЛ"]
[null,null,null,null,null,"Алтайский край","Иной документ",null,"Иной документ, предусмотренные законодательством РФ"]
[null,null,null,null,null,"Амурская обл"]
[null,null,null,null,null,"Архангельская обл"]
[null,null,null,null,null,"Астраханская обл"]
[null,null,null,null,null,"г Байконур"]
[null,null,null,null,null,"Башкортостан Респ"]
[null,null,null,null,null,"Белгородская обл"]
[null,null,null,null,null,"Брянская обл"]
[null,null,null,null,null,"Бурятия Респ"]
[null,null,null,null,null,"Владимирская обл"]
[null,null,null,null,null,"Волгоградская обл"]
[null,null,null,null,null,"Вологодская обл"]
[null,null,null,null,null,"Воронежская обл"]
[null,null,null,null,null,"Дагестан Респ"]
[null,null,null,null,null,"Еврейская Аобл"]
[null,null,null,null,null,"Забайкальский край"]
[null,null,null,null,null,"Забайкальский край "]
[null,null,null,null,null,"Ивановская обл"]
[null,null,null,null,null,"Ингушетия Респ"]
[null,null,null,null,null,"Иркутская обл"]
[null,null,null,null,null,"Иркутская обл "]
[null,null,null,null,null,"Кабардино-Балкарская Респ"]
[null,null,null,null,null,"Калининградская обл"]
[null,null,null,null,null,"Калмыкия Респ"]
[null,null,null,null,null,"Калужская обл"]
[null,null,null,null,null,"Камчатский край"]
[null,null,null,null,null,"Карачаево-Черкесская Респ"]
[null,null,null,null,null,"Карелия Респ"]
[null,null,null,null,null,"Кемеровская обл "]
[null,null,null,null,null,"Кировская обл"]
[null,null,null,null,null,"Коми Респ"]
[null,null,null,null,null,"Коми-Пермяцкий АО"]
[null,null,null,null,null,"Корякский АО"]
[null,null,null,null,null,"Костромская обл"]
[null,null,null,null,null,"Краснодарский край"]
[null,null,null,null,null,"Красноярский край"]
[null,null,null,null,null,"Крым Респ"]
[null,null,null,null,null,"Кузбасс обл"]
[null,null,null,null,null,"Курганская обл"]
[null,null,null,null,null,"Курская обл"]
[null,null,null,null,null,"Ленинградская обл"]
[null,null,null,null,null,"Липецкая обл"]
[null,null,null,null,null,"Магаданская обл"]
[null,null,null,null,null,"Марий Эл Респ"]
[null,null,null,null,null,"Мордовия Респ"]
[null,null,null,null,null,"Мурманская обл"]
[null,null,null,null,null,"Ненецкий АО"]
[null,null,null,null,null,"Нижегородская обл"]
[null,null,null,null,null,"Новгородская обл"]
[null,null,null,null,null,"Новосибирская обл"]
[null,null,null,null,null,"Омская обл"]
[null,null,null,null,null,"Оренбургская обл"]
[null,null,null,null,null,"Орловская обл"]
[null,null,null,null,null,"Пензенская обл"]
{"$rows_left_out":35}
{"sheet":"OperationsInput","index":2,"n_rows":3,"n_cols":3,"rows_kept":3,"cut":false,"hidden":true,"merged":[]}
["Форма для заполнения бек-офисом после получения заполненной формы",null,{"$f":"ContractNumberCreator!J2","v":"SG-БП20230605090442"}]
["Договор №","SG-БП20210823131345","<------------------"]
["Договор От","2021-07-23","<------------------"]

{"sheet":"PrintInvoice","index":3,"n_rows":23,"n_cols":8,"rows_kept":23,"cut":false,"hidden":true,"merged":[[15,1,15,7],[20,1,20,7],[21,6,21,7],[7,1,7,3],[7,6,7,7],[8,6,8,7],[9,1,9,3],[9,6,9,7],[12,2,12,7],[14,2,14,7]]}
[]
[]
[null,"Общество с ограниченной ответственностью \"РБ Страхование\""]
[null,"107078 г. Москва, ул. Маши Порываевой, д.34, этаж 2, ком.62"]
[]
[null,"ИНН ",7709927260," КПП 770901001"]
[null,"Получатель"]
[null,"ООО \"РБ Страхование\"",null,null,null,"Сч. №","40702810797570000475"]
[null,"Банк получателя",null,null,null,"БИК","044525256"]
[null,"Московский филиал ПАО РОСБАНК г. Москва",null,null,null,"Сч. №","30101810000000000256"]
[null,{"$f":"IF(Form!A90<>\"\",\"Счет не может быть сформирован - в заявке присутствуют незаполненные обязательные поля! Просьба вернутьзаявку клиенту/сотруднику для корректировки заполнения.\",\"\")","v":"Счет не может быть сформирован - в заявке присутствуют незаполненные обязательные поля! Просьба вернутьзаявку клиенту/сотруднику для корректировки заполнения."}]
[null,{"$f":"IF(B11<>\"\",\"\",\"СЧЕТ\")","v":""}]
[null,{"$f":"IF(B11<>\"\",\"\",\"Плательщик:\")","v":""},{"$f":"IF(B11<>\"\",\"\",CONCATENATE(Form!B8,\" \",Form!B9,\" \",Form!B10))","v":""}]
[]
[null,{"$f":"IF(B11<>\"\",\"\",\"Назначение платежа:\")","v":""},{"$f":"IF(B11<>\"\",\"\",CONCATENATE(\"Стр. премия. по дог. \",OperationsInput!B2,\" от \",IF(TEXT(OperationsInput!B3,\"дд-ММ-гггг\")=\"дд-ММ-гггг\",TEXT(OperationsInput!B3,\"dd-mm-yyyy\"),TEXT(OperationsInput!B3,\"дд-ММ-гггг\")),\", \",C13))","v":""}]
[null,{"$f":"IF(B11<>\"\",\"\",\"НДС не облагается\")","v":""}]
[]
[null,null,null,null,null,"Итого:",{"$f":"Form!B3","v":2440},"Рублей РФ"]
[null,null,null,null,null,"НДС не облагается.","   -"]
[null,null,null,null,null,"Всего к оплате:",{"$f":"Form!B3","v":2440},"Рублей РФ"]
[null,{"$f":"CONCATENATE(SummToText!B3)","v":"Две тысячи четыреста сорок рублей РФ, 00 коп."}]
[null,null,null,null,null,null,"Генеральный директор\n"]
[null,null,null,null,null,null,"Кардашевский Н.И."]

{"sheet":"DataForINSIS","index":4,"n_rows":2,"n_cols":66,"rows_kept":2,"cut":false,"hidden":true,"merged":[]}
["№ п/п","Название программы страхования","Фамилия страхователя","Имя страхователя","Отчество страхователя","Дата рождения","Место рождения","Пол","ДУЛ: тип","ДУЛ: серия","ДУЛ: номер","ДУЛ: дата выдачи","ДУЛ: кем выдан","ДУЛ: код подразделения","Email","Мобильный телефон","Гражданство","ИНН клиента","Адрес регистрации: регион","Адрес регистрации: город/нас.пункт","Адрес регистрации: улица ","Адрес регистрации: дом ","Адрес регистрации: корпус","Адрес регистрации: строение","Адрес регистрации: квартира ","Адрес регистрации: индекс","Адрес регистрации: КЛАДР код города/нас.пункта","Адрес регистрации: КЛАДР код улицы","Миграционная карта","Документ, подтверждающий право проживания/пребывания в РФ","Срок пребывания в РФ с","Срок пребывания в РФ по","Фактический адрес: регион","Фактический адрес: город/нас.пункт","Фактический адрес: улица ","Фактический адрес: дом ","Фактический адрес: корпус","Фактический адрес: строение","Фактический адрес: квартира ","Фактический адрес: индекс","Фактический адрес: КЛАДР код города/нас.пункта","Фактический адрес: КЛАДР код улицы","Адрес объекта страхования: регион","Адрес объекта страхования: город/нас.пункт","Адрес объекта страхования: улица ","Адрес объекта страхования: дом ","Адрес объекта страхования: корпус","Адрес объекта страхования: строение","Адрес объекта страхования: квартира ","Адрес объекта страхования: индекс","Адрес объекта страхования: КЛАДР код города/нас.пункта","Адрес объекта страхования: КЛАДР код улицы","Номер страхового полиса","Дата начала страхования","Страховая премия  ","Срок в месяцах","Автопролонгация","№ Доп.Офиса Банка","ФИО сотрудника","Должность сотрудника","Наименование филиала","Код ОКАТО отделения банка, к которому относится УРМ","№ БСС заемщика","БИК","Признак частного дома","Код ФИАС"]
[1,{"$f":"VLOOKUP(Form!B2,master!O1:P5,2,FALSE)","v":"Comfort_SG"},{"$f":"IF(Form!B8=\"\",\"\",Form!B8)","v":""},{"$f":"IF(Form!B9=\"\",\"\",Form!B9)","v":""},{"$f":"IF(Form!B10=\"\",\"\",Form!B10)","v":""},{"$f":"IF(Form!B11=\"\",\"\",Form!B11)","v":""},{"$f":"IF(Form!B14=\"\",\"\",Form!B14)","v":""},{"$f":"LEFT(Form!B12,1)","v":"М"},{"$f":"Form!B17","v":"Паспорт гражданина РФ"},{"$f":"IF(Form!B19=\"\",\"\",Form!B19)","v":""},{"$f":"IF(Form!B20=\"\",\"\",Form!B20)","v":""},{"$f":"IF(Form!B22=\"\",\"\",Form!B22)","v":""},{"$f":"IF(Form!B21=\"\",\"\",Form!B21)","v":""},{"$f":"IF(Form!B23=\"\",\"\",Form!B23)","v":""},{"$f":"IF(Form!B86=\"\",\"\",Form!B86)","v":""},{"$f":"IF(Form!B87=\"\",\"\",Form!B87)","v":""},{"$f":"IF(Form!B18=\"\",\"\",Form!B18)","v":""},{"$f":"IF(Form!B13=\"\",\"\",Form!B13)","v":""},{"$f":"Form!B34","v":"г Москва"},{"$f":"IF(Form!B35=\"\",\"\",Form!B35)","v":""},{"$f":"IF(Form!B36=\"\",\"\",Form!B36)","v":""},{"$f":"IF(Form!B37=\"\",\"\",Form!B37)","v":""},{"$f":"IF(Form!B38=\"\",\"\",Form!B38)","v":""},{"$f":"IF(Form!B39=\"\",\"\",Form!B39)","v":""},{"$f":"IF(Form!B40=\"\",\"\",Form!B40)","v":""},{"$f":"IF(Form!B41=\"\",\"\",Form!B41)","v":""},{"$f":"LEFT(IF(Form!B43=\"\",\"\",Form!B43),13)","v":""},{"$f":"LEFT(IF(Form!B42=\"\",\"\",Form!B42),17)","v":""},{"$f":"IF(Form!B26=\"\",\"\",Form!B26)","v":""},{"$f":"IF(Form!B29=\"<please choose>\",\"\",Form!B29)","v":""},{"$f":"IF(Form!B30=\"\",\"\",Form!B30)","v":""},{"$f":"IF(Form!B31=\"\",\"\",Form!B31)","v":""},{"$f":"IF(Form!$B$46=master!$K$2,DataForINSIS!S2,Form!$B47)","v":"г Москва"},{"$f":"IF(Form!$B$46=master!$K$2,DataForINSIS!T2,IF(Form!$B48=\"\",\"\",Form!$B48))","v":""},{"$f":"IF(Form!$B$46=master!$K$2,DataForINSIS!U2,IF(Form!$B49=\"\",\"\",Form!$B49))","v":""},{"$f":"IF(Form!$B$46=master!$K$2,DataForINSIS!V2,IF(Form!$B50=\"\",\"\",Form!$B50))","v":""},{"$f":"IF(Form!$B$46=master!$K$2,DataForINSIS!W2,IF(Form!$B51=\"\",\"\",Form!$B51))","v":""},{"$f":"IF(Form!$B$46=master!$K$2,DataForINSIS!X2,IF(Form!$B52=\"\",\"\",Form!$B52))","v":""},{"$f":"IF(Form!$B$46=master!$K$2,DataForINSIS!Y2,IF(Form!$B53=\"\",\"\",Form!$B53))","v":""},{"$f":"IF(Form!$B$46=master!$K$2,DataForINSIS!Z2,IF(Form!$B54=\"\",\"\",Form!$B54))","v":""},{"$f":"LEFT(IF(Form!$B$46=master!$K$2,DataForINSIS!AA2,IF(Form!$B56=\"\",\"\",Form!$B56)),13)","v":""},{"$f":"LEFT(IF(Form!$B$46=master!$K$2,DataForINSIS!AB2,IF(Form!$B55=\"\",\"\",Form!$B55)),17)","v":""},{"$f":"IF(Form!$B$59=master!$H1,DataForINSIS!S2,IF(Form!$B$59=master!$H2,DataForINSIS!AG2,Form!$B60))","v":"Московская обл"},{"$f":"IF(Form!$B$59=master!$H1,DataForINSIS!T2,IF(Form!$B$59=master!$H2,DataForINSIS!AH2,IF(Form!$B61=\"\",\"\",Form!$B61)))","v":""},{"$f":"IF(Form!$B$59=master!$H1,DataForINSIS!U2,IF(Form!$B$59=master!$H2,DataForINSIS!AIH2,IF(Form!$B62=\"\",\"\",Form!$B62)))","v":""},{"$f":"IF(Form!$B$59=master!$H1,DataForINSIS!V2,IF(Form!$B$59=master!$H2,DataForINSIS!AJ2,IF(Form!$B63=\"\",\"\",Form!$B63)))","v":""},{"$f":"IF(Form!$B$59=master!$H1,DataForINSIS!W2,IF(Form!$B$59=master!$H2,DataForINSIS!AK2,IF(Form!$B64=\"\",\"\",Form!$B64)))","v":""},{"$f":"IF(Form!$B$59=master!$H1,DataForINSIS!X2,IF(Form!$B$59=master!$H2,DataForINSIS!AL2,IF(Form!$B65=\"\",\"\",Form!$B65)))","v":""},{"$f":"IF(Form!$B$59=master!$H1,DataForINSIS!Y2,IF(Form!$B$59=master!$H2,DataForINSIS!AM2,IF(Form!$B66=\"\",\"\",Form!$B66)))","v":""},{"$f":"IF(Form!$B$59=master!$H1,DataForINSIS!Z2,IF(Form!$B$59=master!$H2,DataForINSIS!AN2,IF(Form!$B67=\"\",\"\",Form!$B67)))","v":""},{"$f":"LEFT(IF(Form!$B$59=master!$H1,DataForINSIS!AA2,IF(Form!$B$59=master!$H2,DataForINSIS!AO2,IF(Form!$B69=\"\",\"\",Form!$B69))),13)","v":""},{"$f":"LEFT(IF(Form!$B$59=master!$H1,DataForINSIS!AB2,IF(Form!$B$59=master!$H2,DataForINSIS!AP2,IF(Form!$B68=\"\",\"\",Form!$B68))),17)","v":""},{"$f":"IF(OperationsInput!B2=\"\",\"\",OperationsInput!B2)","v":"SG-БП20210823131345"},{"$f":"IF(OperationsInput!B3=\"\",\"\",OperationsInput!B3)","v":"2021-07-23"},{"$f":"Form!B3","v":2440},12,"NO",null,null,null,null,null,null,null,{"$f":"IF(Form!B71 = \"Да / Yes\",1,0)","v":1},{"$f":"LEFT(IF(Form!$B$59=master!$H1,DataForINSIS!AB2,IF(Form!$B$59=master!$H2,DataForINSIS!AP2,IF(Form!$B70=\"\",\"\",Form!$B70))),36)","v":"441bbc4c-3578-4c84-900e-0ca7ea872cec"}]

{"sheet":"ContractNumberCreator","index":5,"n_rows":2,"n_cols":10,"rows_kept":2,"cut":false,"hidden":true,"merged":[]}
["now",null,"Year","Month","Day","hours","Minutes","Sec",null,"Contract number"]
[{"$f":"NOW()","v":"2023-06-05T09:04:42.340"},null,{"$f":"YEAR(A2)","v":2023},{"$f":"RIGHT(\"0\"&MONTH(A2),2)","v":"06"},{"$f":"RIGHT(\"0\"&DAY(A2),2)","v":"05"},{"$f":"RIGHT(\"0\"&HOUR(A2),2)","v":"09"},{"$f":"RIGHT(\"0\"&MINUTE(A2),2)","v":"04"},{"$f":"RIGHT(\"0\"&SECOND(A2),2)","v":"42"},null,{"$f":"CONCATENATE(\"SG-БП\",C2,D2,E2,F2,G2,H2)","v":"SG-БП20230605090442"}]

{"sheet":"SummToText","index":6,"n_rows":43,"n_cols":7,"rows_kept":43,"cut":false,"hidden":true,"merged":[]}
[]
[null,null,null,null,{"$f":"Form!B3","v":2440}]
["Заглавная без НДС",{"$f":"SUBSTITUTE(B5,F9,F10,1)","v":"Две тысячи четыреста сорок рублей РФ, 00 коп."}]
["Заглавная с НДС",{"$f":"SUBSTITUTE(B6,F9,F10,1)","v":"Две тысячи четыреста сорок рублей 00 коп.)"}]
["маленькая без НДС",{"$f":"CONCATENATE(A8,A9,A10,A11,\"РФ, \",A12)","v":"две тысячи четыреста сорок рублей РФ, 00 коп."}]
["маленькая с НДС",{"$f":"CONCATENATE(A8,A9,A10,A11,A12,B8,B9,C9)","v":"две тысячи четыреста сорок рублей 00 коп.)"}]
[]
["",null,null,null,null,{"$f":"CODE(B6)","v":228}]
["",null,")",null,null,{"$f":"CHAR(F8)","v":"д"}]
[{"$f":"CONCATENATE(IF(B23=0,\"\",E23),IF(C25<20,IF(C25<16,IF(C25<10,E24,D25),F25),E24),IF(B25=0,\"\",IF(NOT(B24=1),E25,\"\")),F26)","v":"две тысячи "},null,null,null,null,{"$f":"PROPER(F9)","v":"Д"}]
[{"$f":"CONCATENATE(IF(B27=0,\"\",E27),IF(C29<20,IF(C29<16,IF(C29<10,E28,D29),F29),E28),IF(B29=0,\"\",IF(NOT(B28=1),E29,\"\")),F30)","v":"четыреста сорок рублей "}]
[{"$f":"CONCATENATE(IF(C31=0,\"0\",C31),IF(C32=0,\"0\",C32),\" \",F33)","v":"00 коп."}]
[null,null,null,null,{"$f":"E2","v":2440},"рублей"]
[{"$f":"TRUNC(A15/10)","v":0}]
[{"$f":"TRUNC(A16/10)","v":0},{"$f":"TRUNC(RIGHT(A15))","v":0},{"$f":"B15","v":0},null,{"$f":"IF(B15=1,E43,IF(B15=2,G35,IF(B15=3,G36,IF(B15=4,G37,IF(B15=5,G38,IF(B15=6,G39,IF(B15=7,G40,IF(B15=8,G41,G42))))))))","v":"девятьсот "}]
[{"$f":"TRUNC(A17/10)","v":0},{"$f":"TRUNC(RIGHT(A16))","v":0},{"$f":"IF(B16=1,\"\",B16)","v":0},null,{"$f":"IF(OR(C16=0,B16=1),\"\",IF(B16=2,E35,IF(B16=3,E36,IF(B16=4,E37,IF(B16=5,E38,IF(B16=6,E39,IF(B16=7,E40,IF(B16=8,E41,E42))))))))","v":""}]
[{"$f":"TRUNC(A19/10)","v":0},{"$f":"TRUNC(RIGHT(A17))","v":0},{"$f":"IF(B16=1,B17+10,IF(B17=0,0,B17))","v":0},{"$f":"IF(AND(C17>9,C17<16),IF(C17=10,D34,IF(C17=11,D35,IF(C17=12,D36,IF(C17=13,D37,IF(C17=14,D38,IF(C17=15,D39,)))))),\"\")","v":""},{"$f":"IF(B17=1,A34,IF(B17=2,A35,IF(B17=3,A36,IF(B17=4,A37,IF(B17=5,A38,IF(B17=6,A39,IF(B17=7,A40,IF(B17=8,A41,A42))))))))","v":"девять "},{"$f":"IF(AND(C17>15,C17<20),IF(C17=16,D40,IF(C17=17,D41,IF(C17=18,D42,IF(C17=19,D43,)))),\"\")","v":""}]
[null,null,null,null,{"$f":"B17+B16*10+B15*100","v":0},{"$f":"IF(E18=0,\"\",IF(B16=1,\"миллиардов \",IF(B17=1,\"милиард \",IF(OR(B17=2,B17=3,B17=4),\"миллиарда \",\"милиардов \"))))","v":""}]
[{"$f":"TRUNC(A20/10)","v":0},{"$f":"TRUNC(RIGHT(A19))","v":0},{"$f":"B19","v":0},null,{"$f":"IF(B19=1,E43,IF(B19=2,G35,IF(B19=3,G36,IF(B19=4,G37,IF(B19=5,G38,IF(B19=6,G39,IF(B19=7,G40,IF(B19=8,G41,G42))))))))","v":"девятьсот "}]
[{"$f":"TRUNC(A21/10)","v":0},{"$f":"TRUNC(RIGHT(A20))","v":0},{"$f":"IF(B20=1,\"\",B20)","v":0},null,{"$f":"IF(OR(C20=0,B20=1),\"\",IF(B20=2,E35,IF(B20=3,E36,IF(B20=4,E37,IF(B20=5,E38,IF(B20=6,E39,IF(B20=7,E40,IF(B20=8,E41,E42))))))))","v":""}]
[{"$f":"TRUNC(A23/10)","v":0},{"$f":"TRUNC(RIGHT(A21))","v":0},{"$f":"IF(B20=1,B21+10,IF(B21=0,0,B21))","v":0},{"$f":"IF(AND(C21>9,C21<16),IF(C21=10,D34,IF(C21=11,D35,IF(C21=12,D36,IF(C21=13,D37,IF(C21=14,D38,IF(C21=15,D39,)))))),\"\")","v":""},{"$f":"IF(B21=1,A34,IF(B21=2,A35,IF(B21=3,A36,IF(B21=4,A37,IF(B21=5,A38,IF(B21=6,A39,IF(B21=7,A40,IF(B21=8,A41,A42))))))))","v":"девять "},{"$f":"IF(AND(C21>15,C21<20),IF(C21=16,D40,IF(C21=17,D41,IF(C21=18,D42,IF(C21=19,D43,)))),\"\")","v":""}]
[null,null,null,null,{"$f":"B21+B20*10+B19*100","v":0},{"$f":"IF(E22=0,\"\",IF(B20=1,\"миллионов \",IF(B21=1,\"миллион \",IF(OR(B21=2,B21=3,B21=4),\"миллиона \",\"миллионов \"))))","v":""}]
[{"$f":"TRUNC(A24/10)","v":0},{"$f":"TRUNC(RIGHT(A23))","v":0},{"$f":"B23","v":0},null,{"$f":"IF(B23=1,E43,IF(B23=2,G35,IF(B23=3,G36,IF(B23=4,G37,IF(B23=5,G38,IF(B23=6,G39,IF(B23=7,G40,IF(B23=8,G41,G42))))))))","v":"девятьсот "}]
[{"$f":"TRUNC(A25/10)","v":0},{"$f":"TRUNC(RIGHT(A24))","v":0},{"$f":"IF(B24=1,\"\",B24)","v":0},null,{"$f":"IF(OR(C24=0,B24=1),\"\",IF(B24=2,E35,IF(B24=3,E36,IF(B24=4,E37,IF(B24=5,E38,IF(B24=6,E39,IF(B24=7,E40,IF(B24=8,E41,E42))))))))","v":""}]
[{"$f":"TRUNC(A27/10)","v":2},{"$f":"TRUNC(RIGHT(A25))","v":2},{"$f":"IF(B24=1,B25+10,IF(B25=0,0,B25))","v":2},{"$f":"IF(AND(C25>9,C25<16),IF(C25=10,D34,IF(C25=11,D35,IF(C25=12,D36,IF(C25=13,D37,IF(C25=14,D38,IF(C25=15,D39,)))))),\"\")","v":""},{"$f":"IF(B25=1,B34,IF(B25=2,B35,IF(B25=3,A36,IF(B25=4,A37,IF(B25=5,A38,IF(B25=6,A39,IF(B25=7,A40,IF(B25=8,A41,A42))))))))","v":"две "},{"$f":"IF(AND(C25>15,C25<20),IF(C25=16,D40,IF(C25=17,D41,IF(C25=18,D42,IF(C25=19,D43,)))),\"\")","v":""}]
[null,null,null,null,{"$f":"B23*100+B24*10+B25","v":2},{"$f":"IF(E26=0,\"\",IF(B24=1,\"тысяч \",IF(B25=1,\"тысяча \",IF(OR(B25=2,B25=3,B25=4),\"тысячи \",\"тысяч \"))))","v":"тысячи "}]
[{"$f":"TRUNC(A28/10)","v":24},{"$f":"TRUNC(RIGHT(A27))","v":4},{"$f":"B27","v":4},null,{"$f":"IF(B27=1,E43,IF(B27=2,G35,IF(B27=3,G36,IF(B27=4,G37,IF(B27=5,G38,IF(B27=6,G39,IF(B27=7,G40,IF(B27=8,G41,G42))))))))","v":"четыреста "}]
[{"$f":"TRUNC(A29/10)","v":244},{"$f":"TRUNC(RIGHT(A28))","v":4},{"$f":"IF(B28=1,\"\",B28)","v":4},null,{"$f":"IF(OR(C28=0,B28=1),\"\",IF(C28=2,E35,IF(C28=3,E36,IF(C28=4,E37,IF(C28=5,E38,IF(C28=6,E39,IF(C28=7,E40,IF(C28=8,E41,E42))))))))","v":"сорок "}]
[{"$f":"E13","v":2440},{"$f":"TRUNC(RIGHT(A29))","v":0},{"$f":"IF(B28=1,B29+10,IF(B29=0,0,B29))","v":0},{"$f":"IF(AND(C29>9,C29<16),IF(C29=10,D34,IF(C29=11,D35,IF(C29=12,D36,IF(C29=13,D37,IF(C29=14,D38,IF(C29=15,D39,)))))),\"\")","v":""},{"$f":"IF(B29=1,A34,IF(B29=2,A35,IF(B29=3,A36,IF(B29=4,A37,IF(B29=5,A38,IF(B29=6,A39,IF(B29=7,A40,IF(B29=8,A41,A42))))))))","v":"девять "},{"$f":"IF(AND(C29>15,C29<20),IF(C29=16,D40,IF(C29=17,D41,IF(C29=18,D42,IF(C29=19,D43,)))),\"\")","v":""}]
[null,null,null,null,{"$f":"B27*100+B28*10+B29","v":440},{"$f":"IF(E30+E26+E22+E18=0,\"ноль рублей \",IF(C29=1,\"рубль \",IF(OR(C29=2,C29=3,C29=4),\"рубля \",\"рублей \")))","v":"рублей "}]
[{"$f":"ROUND(100*(E2-E13),0)","v":0},null,{"$f":"TRUNC(A31/10)","v":0},null,{"$f":"IF(OR(C31=1,C31=0),\"\",IF(C31=2,E35,IF(C31=3,E36,IF(C31=4,E37,IF(C31=5,E38,IF(C31=6,E39,IF(C31=7,E40,IF(C31=8,E41,E42))))))))","v":""}]
[null,null,{"$f":"TRUNC(A31-C31*10)","v":0},null,{"$f":"IF(C32=1,B34,IF(C32=2,B35,IF(C32=3,A36,IF(C32=4,A37,IF(C32=5,A38,IF(C32=6,A39,IF(C32=7,A40,IF(C32=8,A41,A42))))))))","v":"девять "}]
[null,null,null,null,null,"коп."]
["один ","одна ",null,"десять "]
["два ","две ",null,"одиннадцать ","двадцать ",null,"двести "]
["три ",null,null,"двенадцать ","тридцать ",null,"триста "]
["четыре ",null,null,"тринадцать ","сорок ",null,"четыреста "]
["пять ",null,null,"четырнадцать ","пятьдесят ",null,"пятьсот "]
["шесть ",null,null,"пятнадцать ","шестьдесят ",null,"шестьсот "]
["семь ",null,null,"шестнадцать ","семьдесят ",null,"семьсот "]
["восемь ",null,null,"семнадцать ","восемьдесят ",null,"восемьсот "]
["девять ",null,null,"восемнадцать ","девяносто ",null,"девятьсот "]
[null,null,null,"девятнадцать ","сто "]